Fixing undefined symbol



c -o test). axf: Error: L6218E: Undefined symbol TimingDelay_Decrement (referred from stm32f4xx_it. ready ( function () { $ ( ". 4 and below. That said, array identifiers ARE pointers, but the compiler is nice about it so doing ptrPrintVal = &printVal; or doing ptrPrintVal Stack Exchange network consists of 178 Q&A communities including Stack Overflow, the largest, most trusted online community for developers to learn, share their knowledge, and build their careers. Status: offline. What exactly are ‘symbols’? The concept and term of a symbol is used in many different programming languages. After a couple of hours, this is the only way I could fix the problem: I purged LibreOffice: sudo apt-get purge libreoffice* And then I deleted the /usr/lib libreoffice directory: 2017-10-17 17:42. o ld: symbol(s) not found for architecture x86_64 clang: error: linker command failed with exit code 1 (use -v to see invocation) The short test program (compiling using clang test. The $ symbol is used by jQuery for selecting elements. extern InvalidateImage(const char *); and later using it. 5, you might run into something like: Undefined symbols for architecture i386: "_xmlTextReaderSchemaValidate", referenced from: _zim_xmlreader_setSchema in php_xmlreader. Have a fresh pull from master as of late Friday afternoon and this missing symbol pops up at runtime. 4. When I run Gazebo with a plugin I wrote, plank_drop. Share. Perhaps my situation is not usual: i try to test, run and publish my first Unity app on ios without any real testing device, use only simulator. I am running CVI 2015 with a simple app that reads data from a spectracom GPS device. Everything is working fine (I can compile and run my CUDA code), but nvidia-settings fails: ERROR: /usr/lib/libnvidia-gtk3. Undefined symbol in C++ template member function when put on vxWorks. 6 from there. You probably have code in your project that looks as follows: You probably have code in your project that looks as follows: $ ( document ). Quote: Originally Posted by Owyn. 2-9 Hi, I have just installed the latest CUDA on my Ubuntu 16. 2 Regression] Build failure on sparc-sun-solaris2. How to Fix “could not open default font ‘fixed'” iptables rules for Samba 4 in Red Hat Linux 2 thoughts on “Fix “usr/bin/Xvnc: undefined symbol: pixman_composite_trapezoids”” When I try to build my project after changing the Target Type, LabWindows/CVI throws several link errors: Undefined symbol'__CompiledDebuggingLevel' referenced in "C:\Program Files\National Instruments\CVI2012\bin\msvc\cvistart. Usually one states "we leave the statement undefined". whenever i try to compile a c program, the linker gives that "undefined symbol" stuff. 6, libdecoration0 had been upgraded to 0. After that app successfully build and run in xcode. 8. conf Apache fails to start: undefined symbol: ap_unixd_setup_child Taras Ermoshin To do this, go to Build >> Target Type, and specify Dynamic Link Library. Like Devicenull said , find whatever is : Code: strtonum. Here is a list of the most common types of linker errors, and the appropriate action to either fix the problem or obtain additional information. 10. you need to define how this is executed and when. exe error: Undefined symbol '__imp___iob_func' referenced in "c:\\Progra If you replace the arrow function with a regular function it will probably fix the issue for you. plesk repair installation command produces an error: File not found: example. LIB + MATH (S,T,C,M,L - for model) + C (S,T,C,M,L - for model) UNDEFINED SYMBOL LINKING C/C++ AND ASSEMBLY MODULES There are several sources of undefined symbol errors when trying to link assembly How I fix this error: 'undefined reference to symbol' compress ''? First, the OS is Slackware 14. LIB + MATH (S,T,C,M,L - for model) + C (S,T,C,M,L - for model) UNDEFINED SYMBOL LINKING C/C++ AND ASSEMBLY MODULES There are several sources of undefined symbol errors when trying to link assembly undefined reference to symbol 'keypad' Undefined reference to symbol 'acs_map' when running makeconfig; My solution to the issue was to add the compiler flag -ltinfo. 4. Usage Data Processing by Google. I have one programs written in LabWindows 2. The way to fix this error is to explicitly scope the variable using ‘::’ outside the main before using it. Diagnostic Steps. How To Fix symbol lookup error: /usr/sbin/httpd2-prefork: undefined symbol: apr_ldap_ssl_init Posted by Artem Russakovskii on July 29th, 2008 in Linux Apache stopped starting today for no apparent reason. c Undefined symbols for architecture x86_64: "_sm_new", referenced from: _main in test-5d3bc4. 5: undefined symbol: symbol dbus_message_get_allow_interactive_authorization. You can notice that pycurl. 3. For instance, suppose we have the definition of convergence of sequence. (2) Apply a rather ugly patch (uploaded). tbd or setting $ (SDKROOT)/usr/lib/swift worked for me. What is the symbol of undefined? Dividing a number by zero is usually considered undefined. i have 2 separate small projects i tried to compile, one just be trying to learn how to use the xml library, and the other is a multi file c program just for fun, both compile fine with only some small warnings, the usually stuff like "inter to pointer The hard way of fixing this is to revert the modified report to the original and recustomise. Historically it’s been fine to let Xcode go through with the update, but Xcode 6 will modify your build settings to build a 64-bit app by default. iOS ask the native linker to remove unused code from the native library, and if you're lucky, the reference to the inexistent method will be in unused code, so it will end up removed. How to fix "undefined symbol" in CLANG when using simple Template. # nm -D /usr/lib64/libcrypto. Difference between undefined and null. 0. This occurs because the libspatialindex spatial indexing library is either not installed or is not included in your environment variables. So does MIPS16. 1, which requires libcrypto. so, I think it should work, but the server isn't loading it. However, if you export the package, edit in a text editor and replace instances of PM_Payment_WORK with pmRemittanceTemp, change the Key from 7 to 3 and then import the package. x just fine if one wants to. Asking for help, clarification, or responding to other answers. This last one provides the missing symbol: Raw. sudo apt-get install python3-rtree Atlassian Jira Project Management Software (v8. o "_xmlTextReaderSetup", referenced from: _zim_xmlreader_XML in php_xmlreader. Anyone else seen this? AttributeError: python3: undefined symbol: Error_GetLastErrorNum. 9/arm: undefined symbol __floatunsitf Current status: PA needs fixing, probably similarly to ia64-hpux. Let me know if you are still having this issue after doing as I suggested. That's a somewhat misleading statement, one can use mod_cluster 1. . 8 on OS X 10. 0 (I have the evaluation version). 5 instead of 2. ”The time we save is the biggest benefit of E-E to our team. exe: undefined symbol: __libm_feature_flag I've tried setting my LD_LIBRARY path several different ways, augmenting with directory paths with every instance of the libm* on my system, moving the order of the directories around, no luck. So it turns out there was an old "fix" I had for FFMPEG in /etc/ld. 01: undefined symbol: gtk_widget_hide_on_delete libnvidia-gtk3. Spectracom publish a set of libraries to access the device but when I build the app, I see the following linker errors. lib file or else you get this error:"lld-link: error: undefined symbol: (symbol)" Answers (1) May be this issue is because of you do not a function named mexFunction in your MEX-file and that function needs to have a specific signature, if it is the senario, define that function in your MEX-file. This may occur due to many cases. o). If a sequence $(a_n)_{n=m}^\infty$ is not converging to any real number, we say that the sequence $(a_n)_{n=m}^\infty$ is divergent and we leave $\lim_{n\to\infty}a_n$ undefined. conf. But let's go a little further and try to understand why this works . in Developer Studio C/C++/Fortran Compilers. This is on arm64. 2. Code: /* Plugin generated by AMXX-Studio */ #include <amxmodx> #include <amxmisc> #include <fun> #include <cstrike> # Have a fresh pull from master as of late Friday afternoon and this missing symbol pops up at runtime. manager ~0030393. Thanks for contributing an answer to Unix & Linux Stack Exchange! Please be sure to answer the question. Not enough information to list load addresses in the image map. Using apt-get install I installed the following things: apt-get install libopenblas-base apt-get install libopenblas-dev apt-get install python-dev apt-get install gcc apt-get install gfortran. The correct fix is to teach the build system to parse the dependent library list out of the cargo output and append it to the link line of the corresponding final library or executable. and the symbol decor_property_to_quads was present: 24: 00000000 0 FUNC GLOBAL DEFAULT UND decor_property_to_quads. Undefined symbols for architecture x86_64: "ofSetupOpenGL EDIT (PARTIAL) SOLUTION!!!!: After following these steps of the link below I managed to fix the scipy error, I uninstalled numpy, scipy and scikit-learn. Isn’t customized CUDA path being supported in https://github. Hope this helps Bilal DurraniNI 0 Kudos Message 2 of 6 (3,010 Views) Reply 0 Kudos Re: link. So that wasn’t the problem… a little digging in Synaptic and I found out that while I’d held back compiz at 0. So when we try to assign it a value in the main function, the linker doesn’t find the symbol and may result in an “unresolved external symbol” or “undefined reference”. 10 posts After two dozens of comments to understand the situation, it was found that the libhdf5. I'm very new to c++ and CMake, so it's likely I'm overlooking something quite obvious. Possible fix includes: (1) Use a newer version of eu-strip to build the kernel (use of devtoolset-6). When searching the issue it seems that upgrading Xcode is a possible fix, but I’d very much like to avoid that if possible because I have other projects building on the same machine and I’d rather not rock that particular boat too much. test. p. 10 posts As others have indicated, it indicates that there is a symbol that hasn’t been defined. Resolution: Upgrade the system libdbus library. Use Unity to build high-quality 3D and 2D games, deploy them across mobile, desktop, VR/AR, consoles or the Web, and connect with loyal and enthusiastic players and customers. This is due to the fact that the libdbus version in the system is lower than 1. Undefined symbol '_LoadPanel' If you don’t know in which library you can find a certain symbol in, see our post [To be done]. Viewed 6k times So when we try to assign it a value in the main function, the linker doesn’t find the symbol and may result in an “unresolved external symbol” or “undefined reference”. After all, knowledge is power, and if you know what caused your problem, you'll be able to avoid a lot of frustration and wasted time in the future. Subject: Re: [4. Re: :0: error: (499) undefined symbol: Monday, August 24, 2015 6:17 PM ( permalink ) +4 (4) Your code cannot compile without a "main" function, so we are guessing here with half of your project. 1 version for my project. So while compiling PHP 5. thanks for that i done. I had EXTI_callback\EXTI_callback. gnu. 164) of eu-strip and newer kernels causes the reported issue. The name of the variable follows new but not imperative, to assign a value to the variable already atError categories:htt You need to built the SystemC lib on ubuntu. One mile-long dependency chain resolution and about 20 compiles later, I've generated the imap. You forgot to define the declared name. 440. __lock_pin_lock() and its caller lock_pin_lock() are dead code in liblockdep, but we still need to provide a definition of prandom_u32() in case lazy binding is disabled. d/ that was pointing at another lib folder. The following code using static constexp on a class results in and undefined symbol the on the 12. That symbol is defined in a library, and you forgot to link with that library. 6. hide (); alert ( "Button is hidden!" How I fix this error: 'undefined reference to symbol' compress ''? First, the OS is Slackware 14. llvm-10, Wasn’t seeing this from my master build from a few days ago. How to fix Ubuntu/Debian apt-get 404 Not Found Package Repository Errors (Saucy, Raring, Quantal, Oneiric, Natty…) 14 Feb , 2014 How to setup a WordPress PHP site with Nginx, PHP5-FPM, and MySQL using Ajenti V with working Permalinks C++ Errors: Undefined Reference, Unresolved External Symbol Etc. so: cannot open shared object file: No such file or directory /usr/lib/libnvidia-gtk2. tbd on its own during the build, eliminating the need for you to explicitly link it to your project, which also means it won't break backwards compatibility with Xcode 11. Undefined symbol with plugin. Determine the type of unresolved symbol. 0 to 0. CodeProject, 20 Bay Street, 11th Floor Toronto, Ontario, Canada M5J 2N8 +1 (416) 849-8900 Xcode will search that directory for libSwiftWebKit. We will create a basic project calling the png_create_read_struct() function from the libpng library and will go through common missing setup steps, explaining the errors How to Fix “could not open default font ‘fixed'” iptables rules for Samba 4 in Red Hat Linux 2 thoughts on “Fix “usr/bin/Xvnc: undefined symbol: pixman_composite_trapezoids”” “intime: symbol lookup error: bin7/libQt5DBus. This will get you about 25 warnings and some semi-obscure linker errors, compounded by the fact that the scheme still says “32-bit”. Great bit of info, thanks! I ran into this problem and really didn't expect it from PHP 4. conf the following line: Jun 12, 2017 12:05PM edited Jun 16, 2017 9:50AM. I've been stuck on this issue for an embarrassingly long period of time, and would be very grateful for any help. com/dmlc/tvm/pull/1270? Usually one states "we leave the statement undefined". o ld: symbol (s) not found for architecture i386 collect2: ld returned 1 exit status Undefined symbols for architecture x86_64: "_xmlTextReaderSchemaValidate", referenced from: _zim_xmlreader_setSchema in The new keyword creates a variable. lib". 10 | grep -i CRYPTO_set_locking_callback Hi. Anyone else seen this? This is the mail archive of the gcc-help@gcc. i. The fix was to downgrade libdecoration0 from 0. undefined represents the value of a variable that hasn’t been yet initialized, while null represents an intentional absence of an object. the pallette is a custom class you need to call from main. Code: /* Plugin generated by AMXX-Studio */ #include <amxmodx> #include <amxmisc> #include <fun> #include <cstrike> # I don’t believe this should be marked as “[Solved]”. whenever I build target. Modify the parameter LIBS in the Makefile to reflect the change. 6: undefined symbol: _ZNSt8messagesIcE2idE, version GLIBCXX_3. e: LIBS = -llncursew -ltinfo Dec 18, 2011 at 12:21pm. js node: symbol lookup error: /var/www/myp 3. sudo yum install php72-php-xdebug. In the file there is an # forcemerge 584572 623280 quit Hi, Joey Hess wrote: > apt-get: symbol lookup error: /usr/lib/libstdc++. This file is included in the DMCWin32 download. you should add a . By agreeing to this, your usage data will be stored in the USA and processed by Google LLC. 5 linker but links fine in GCC, Clang and Visual C++. 6, and usually happens for Centos 7. It means the linker has looked through all the compiled code you told it to, and it still can't find what it's looking for. To do this, go to Build >> Target Type, and specify Dynamic Link Library. What are undefined reference/unresolved external symbol errors in C++? As the name suggests, a symbol you declared was not defined by you. I had a similar problem with gazebo 2. Even so, if I compile with the full list of arguments (-lCore -lTree -lCint -lReflex -lCintex -lRIO -lHist) then it does compile, but I still get the same run-error: undefined symbol: _ZN13TVersionCheckC1Ei. $ clang test. Look at the library dependencies using the ldd tool. org. It seems I found solution: in Unity -> Build settings -> Player Settings -> Other Settings -> Target SDK = Simulator SDK. It can be installed as easily as running this command and it works perfectly. From: Ben Hutchings <b@decadent. 33. November 15, 2019 libraries, linux, symbols, troubleshooting, undefined reference This tutorial shows how to various problems related to missing symbols in C/C++ projects. LIB + + EMU. h: class Test { public: static constexpr auto CONST_VALUE = "const value"; static constexpr . I don’t believe this should be marked as “[Solved]”. There are several possible reasons for this: 1. const char *foo = InvalidateImage(bar); Because it is a library, you would not notice this until you attempt to run the program which uses this symbol. com. The only concerns are that the binaries provided in the download section are not suitable for that and last but not least, it's a quite untested combination to date. 04. In the file there is an # use strict; our $it; my @fils; foreach my $line (@fils) { if ($line =~ /aa bb cc/) { $it = 4; # do something } if ($it == "4") { # more stuff } } The proposed fix (and the fix microsoft will tell you to do) is to recompile the PHP IMAP module without kerberos support. Let’s explore the difference in some examples. cc, I get the following error: After hours of trying to fix this error, I found that there is an official release of xdebug compatibile with php from remi repository. exe: symbol lookup error: . so. So, a combination of the current version (0. Per #1 we could also fix this particular instance of the bug by writing a shim around the Firefox resolver to replace the system api when linking rust-std into Installing BW - HANA: Error: sdbrun: undefined symbol: PL_charclass. com/dmlc/tvm/pull/1270? . org mailing list for the GCC project. FRV may need fixing, probably by the FRV maintainers. Let's have a look at three of them −. 3a, that I have translate to C in order to be read by LabWindow CVI 7. Then. This is the mail archive of the gcc-help@gcc. It must have taken priority because I saw when I ran teamviewer with strace it was using libfreetype. 10 from the OpenSSL library. 7 was actually a symlink (with several levels of indirection) to a file that was not shared between the queued processes and the interactive processes. Ask Question Asked 2 years, 2 months ago. s. Link GeoMagCalc. It worked for a while, but now when I start with node command, the program exit with this error: node app. \Armboard\Armboard. 9. 2017-10-17 17:42. Execute the command. Fortunately, there is a very simple and straightforward way to fix this issue on Ubuntu. The source for the library can declare a symbol without defining it, by doing something like this. What is the main difference between undefined and null? Both special values imply an empty state. Same make config. 6 with httpd 2. so requires libcurl. /wrf. 2 I had installed the simplescreenrecorder but it did not recognize the vp8 codec. Provide details and share your research! But avoid …. We would like to use Google Analytics to get a better understanding of how you use the website. Unity is the ultimate game development platform. and then call your check_team (id) from a forward you want. I installed bcrypt@3. axf: Error: L6218E: Undefined symbol ex0 (referred from stm32f7xx_it. Atlassian Jira Project Management Software (v8. III. btn-hidden" ). Change your LinkWith attribute to: [assembly: LinkWith (, ForceLoad = false, SmartLink = true)] This will make Xamarin. 4, but it is a paravirtualized server on FC5x86_64 as a DomU with FC6x86_64 as the Dom0, and this was the last little bit to have cPanel fully opterational in a DomU, couldn't seem to get more than 6 hours of uptime out of an FC5 i386 HVM under good load in cPanel. Basically it means ‘a name that refers to something declared somewhere else in more detail’. What could take multiple guys 2 hours or more each to find is accessed in around 15 minutes on Experts Exchange. We will create a basic project calling the png_create_read_struct() function from the libpng library and will go through common missing setup steps, explaining the errors All C++ have to have a int main() class with a "return 0;" from my understanding, and you are missing that. Active 2 years, 2 months ago. 01: undefined symbol: gtk . 6 LTS machine. In many cases, identifying the type of unresolved symbol immediately sheds light on the source of the trouble. look this. 3. 4 > > This system tracks unstable but had been off, and trying to install > something pulled in a new libstdc++6 w/o first upgrading libc6, > which was at version 2. After commenting out the OSRF repo, removing gazebo-current and reinstalling ros-hydro-turtlebot-simulator, which I was trying to run, I got gazebo 1. Neither adding libSwiftWebKit. uk> __lock_pin_lock() now calls prandom_u32() which is not defined in liblockdep. 12-13-2009 , 14:28 Re: undefined symbol. For example, you declared a function in a file and used it somewhere. Moschops (7244) It means you haven't written a function, or you haven't created a variable, or you haven't linked against the library or object code that contains the missing function or variable. With the introduction of small string optimization in C++11 gcc decided to move this into a different (inline) namespace (it is called DualABI). 0, this answer helped. 4, which requires libssh2. In the plugin your porting and change it to : Code: str_to_num. Problem with dlopen. 4#803005-sha1:1f96e09); About Jira; Report a problem; Powered by a free Atlassian Jira open source license for Apache Software Foundation. ” or similar. UNDEFINED SYMBOL WHEN TLINKING FROM DOS COMMAND LINE The TLINK command line must have the libraries in the following order ( GRAPHICS. # 9. C". 1 post views Thread by yamitmehta | last post: by C / C++. May 2, 2021 - by ehekgc This Tutorial Details the Critical Errors that Programmers often Encounter in C++like Undefined Reference, a Segmentation Fault (core dumped) and Unresolved External Symbol: The hard way of fixing this is to revert the modified report to the original and recustomise. When I try to debug the program, I get the following errors messages: Undefined symbol '_round' referenced in "ACXLN. This lld-link error means you forget to link a library. It is often represented with the word UNDEF. Not enough information to list image symbols. To try to fix the problem I added the document /etc/ld.